3-Pentadecanone

Normal alkane RI, non-polar column, temperature ramp

Data compiled by: NIST Mass Spectrometry Data Center, William E. Wallace, director

Column type Capillary
Active phase Cross-Linked Methylsilicone
Column length (m) 25.
Carrier gas He
Substrate
Column diameter (mm) 0.32
Phase thickness (μm)
Tstart (C) 35.
Tend (C) 225.
Heat rate (K/min) 4.
Initial hold (min) 3.
Final hold (min)
I 1675.
ReferenceBravo and Hotchkiss, 1993
Comment MSDC-RI

References

Bravo and Hotchkiss, 1993
Bravo, A.; Hotchkiss, J.H., Identification of volatile compounds resulting from the thermal oxidation of polyethylene, J. Appl. Polym. Sci., 1993, 47, 10, 1741-1748, https://doi.org/10.1002/app.1993.070471004 . [all data]