1,1,3,3-Tetramethyl-1,3-dioctyldisiloxane

Normal alkane RI, non-polar column, temperature ramp

View large format table.

Column type Active phase I Reference Comment
CapillarySE-301941.Crowther, Fazio, et al., 1984100. C @ 3. min, 8. K/min; Column length: 25. m; Tend: 250. C

References

Crowther, Fazio, et al., 1984
Crowther, J.B.; Fazio, S.D.; Schiksnis, R.; Marcus, S.; Hartwick, R.A., Analysis of the acid hydrolysis products of monofunctional chemically bonded stationary phases for high-performance liquid chromatography using capillary gas chromatography, J. Chromatogr., 1984, 289, 367-375, https://doi.org/10.1016/S0021-9673(00)95102-1 . [all data]