Xanthine, 3TMS derivative

Kovats' RI, non-polar column, isothermal

View large format table.

Column type Active phase Temperature (C) I Reference Comment
PackedOV-101160.2010.Miller, Pacáková, et al., 1976Ar, AW-DMCS Chromosorb W HP; Column length: 2. m

Van Den Dool and Kratz RI, non-polar column, temperature ramp

View large format table.

Column type Active phase I Reference Comment
PackedOV-12015.Butts, 1972He, Chromosorb W HP (80-100 mesh), 10. K/min; Column length: 2. m; Tstart: 100. C; Tend: 325. C

Van Den Dool and Kratz RI, non-polar column, custom temperature program

View large format table.

Column type Active phase I Reference Comment
PackedSE-302005.Butts, 1970He, Chromosorb W; Column length: 2. m; Program: not specified

References

Miller, Pacáková, et al., 1976
Miller, V.; Pacáková, V.; Smolková, E., Gas-liquid chromatographic analysis of trimethylsilyl derivatives of pyrimidine and purine bases and nucleosides, J. Chromatogr., 1976, 119, 355-367, https://doi.org/10.1016/S0021-9673(00)86799-0 . [all data]

Butts, 1972
Butts, W.C., Two-Column Gas Chromatography of Trimethylsilyl Derivatives of Biochemically Significant Compounds, Anal. Biochemistry, 1972, 46, 1, 187-199, https://doi.org/10.1016/0003-2697(72)90411-3 . [all data]

Butts, 1970
Butts, W.C., Gas chromatographic separation of trimethylsilyl (TMS)-nucleosides: TMS-methoxime derivatives of cytidine and deoxycytidine, J. Chromatogr. Sci., 1970, 8, 8, 474-476, https://doi.org/10.1093/chromsci/8.8.474 . [all data]