1,2-Dihydrolinalool

Normal alkane RI, polar column, temperature ramp

Data compiled by: NIST Mass Spectrometry Data Center, William E. Wallace, director

Column type Capillary
Active phase Carbowax
Column length (m) 50.
Carrier gas N2
Substrate
Column diameter (mm) 0.2
Phase thickness (μm)
Tstart (C) 80.
Tend (C) 200.
Heat rate (K/min) 1.
Initial hold (min)
Final hold (min) 20.
I 1512.
ReferenceMenon, Chacko, et al., 1999
Comment MSDC-RI

Kovats' RI, polar column, isothermal

Data compiled by: NIST Mass Spectrometry Data Center, William E. Wallace, director

Column type CapillaryCapillaryPacked
Active phase Carbowax 20MPEG-20MCarbowax 20M
Column length (m)  50.
Carrier gas  N2
Substrate
Column diameter (mm)  0.27
Phase thickness (μm) 0.08
Temperature (C) 150.170.150.
I 1537.1487.1537.
ReferenceTudor, Moldovan, et al., 1999Gribanova, Kharitonov, et al., 1990ter Heide, 1976
Comment MSDC-RI MSDC-RI MSDC-RI

Kovats' RI, non-polar column, isothermal

Data compiled by: NIST Mass Spectrometry Data Center, William E. Wallace, director

Column type CapillaryPacked
Active phase OV-101Apiezon L
Column length (m) 50.
Carrier gas N2
Substrate
Column diameter (mm) 0.26
Phase thickness (μm)
Temperature (C) 170.150.
I 1125.1104.
ReferenceGribanova, Kharitonov, et al., 1990ter Heide, 1976
Comment MSDC-RI MSDC-RI

Van Den Dool and Kratz RI, non-polar column, custom temperature program

Data compiled by: NIST Mass Spectrometry Data Center, William E. Wallace, director

Column type Capillary
Active phase HP-5MS
Column length (m) 30.
Carrier gas He
Substrate
Column diameter (mm) 0.25
Phase thickness (μm) 0.25
Program 60C (1 min) => 5 C/min => 210C => 10 C/min => 280C (15 min)
I 1135.8
ReferenceAndriamaharavo, 2014
Comment MSDC-RI

References

Menon, Chacko, et al., 1999
Menon, A.N.; Chacko, S.; Narayanan, C.S., Free and glycosidically bound volatiles of cardamom (Eletteria cardamomum Maton var. miniscula Burkill), Flavour Fragr. J., 1999, 14, 1, 65-68, https://doi.org/10.1002/(SICI)1099-1026(199901/02)14:1<65::AID-FFJ789>3.0.CO;2-A . [all data]