Benzeneacetonitrile, α-methyl-

Phase change data

Data compiled by: William E. Acree, Jr., James S. Chickos

Quantity Value Units Method Reference Comment
Δvap60.9 ± 0.7kJ/molGSVerevkin, 2000Based on data from 284. - 318. K.

Enthalpy of vaporization

ΔvapH (kJ/mol) Temperature (K) Method Reference Comment
60.8 ± 0.7301.GSVerevkin, 2000Based on data from 284. - 318. K.

References

Verevkin, 2000
Verevkin, Sergey P., Strain effects in phenyl substituted methanes. Geminal interactions between phenyl and electron-withdrawing cyano substituent in benzylcyanides, The Journal of Chemical Thermodynamics, 2000, 32, 2, 207-215, https://doi.org/10.1006/jcht.1999.0591 . [all data]