1,5-Methano-8H-pyrido[1,2-a][1,5]diazocin-8-one, decahydro-3-methyl-

Normal alkane RI, non-polar column, temperature ramp

View large format table.

Column type Active phase I Reference Comment
CapillaryDB-11800.Greinwald, Henrichs, et al., 1995He, 6. K/min; Column length: 30. m; Column diameter: 0.32 mm; Tstart: 150. C; Tend: 300. C

References

Greinwald, Henrichs, et al., 1995
Greinwald, R.; Henrichs, C.; Veen, G.; Ross, J.H.; Witte, L.; Czygan, F.-C., A survey of alkaloids in templetonia biloba (Benth.) Polhill (Fabaceae: Brongniartieae), Biochem. Syst. Ecol., 1995, 23, 6, 649-654, https://doi.org/10.1016/0305-1978(95)00035-6 . [all data]