Benzyl(ethenyl)dimethylsilane

Condensed phase thermochemistry data

Data compiled by: Eugene S. Domalski and Elizabeth D. Hearing

Quantity Value Units Method Reference Comment
liquid399.4J/mol*KN/ALebedev, Lebedev, et al., 1981
liquid399.4J/mol*KN/ALebedev, Lebedev, et al., 1979

Constant pressure heat capacity of liquid

Cp,liquid (J/mol*K) Temperature (K) Reference Comment
312.2298.15Lebedev, Lebedev, et al., 1981T = 5 to 330 K.
312.2298.15Lebedev, Lebedev, et al., 1979T = 9 to 330 K.

References

Lebedev, Lebedev, et al., 1981
Lebedev, B.V.; Lebedev, N.K.; Khotimskii, V.S.; Durgar'yan, S.G.; Nametkin, N.S., Thermodynamics of polymerization of vinylorganosilanes, Dokl. Akad. Nauk, 1981, SSSR 259, 629-633. [all data]

Lebedev, Lebedev, et al., 1979
Lebedev, N.K.; Lebedev, B.V.; Khotimskii, V.S.; Durgar'yan, S.G., The calorimetric study of vinylbenzyldimethylsilane, polyvinylbenzyldimethylsilane and the process of vinylbenzyldimethylsilane polymerization in the region 9 to 330 K, Vysokomol. Soedin., Ser., 1979, A 21, 1031-1036. [all data]