N,N'-di-n-Butylurea

Phase change data

Data compiled as indicated in comments:
TRC - Thermodynamics Research Center, NIST Boulder Laboratories, Chris Muzny director
AC - William E. Acree, Jr., James S. Chickos
DH - Eugene S. Domalski and Elizabeth D. Hearing
CAL - James S. Chickos, William E. Acree, Jr., Joel F. Liebman, Students of Chem 202 (Introduction to the Literature of Chemistry), University of Missouri -- St. Louis

Quantity Value Units Method Reference Comment
Tfus346.9KN/ADellaGatta and Ferro, 1987Crystal phase 1 phase; Uncertainty assigned by TRC = 0.3 K; TRC

Enthalpy of vaporization

ΔvapH (kJ/mol) Temperature (K) Reference Comment
101.1 ± 1.6396.Piacente, Ferro, et al., 1990Based on data from 379. - 413. K.; AC

Enthalpy of sublimation

ΔsubH (kJ/mol) Temperature (K) Method Reference Comment
91.9 ± 0.9348.MEZaitsau, Kabo, et al., 2003Based on data from 323. - 372. K.; AC
91.9 ± 0.9350.MEZaitsau, Kabo, et al., 2003Based on data from 323. - 372. K.; AC
90.0 ± 1.0350.CZaitsau, Kabo, et al., 2003AC

Enthalpy of fusion

ΔfusH (kJ/mol) Temperature (K) Reference Comment
14.870346.9Della Gatta and Ferro, 1987DH
14.87349.6Domalski and Hearing, 1996AC

Entropy of fusion

ΔfusS (J/mol*K) Temperature (K) Reference Comment
42.8346.9Della Gatta and Ferro, 1987DH

Entropy of fusion

ΔfusS (J/mol*K) Temperature (K) Reference Comment
35.63311.5Domalski and Hearing, 1996CAL
42.87346.9

Enthalpy of phase transition

ΔHtrs (kJ/mol) Temperature (K) Initial Phase Final Phase Reference Comment
11.100311.5crystaline, IIcrystaline, IDella Gatta and Ferro, 1987DH

Entropy of phase transition

ΔStrs (J/mol*K) Temperature (K) Initial Phase Final Phase Reference Comment
35.6311.5crystaline, IIcrystaline, IDella Gatta and Ferro, 1987DH

In addition to the Thermodynamics Research Center (TRC) data available from this site, much more physical and chemical property data is available from the following TRC products:

References

DellaGatta and Ferro, 1987
DellaGatta, G.; Ferro, D., Enthalpies of fusion and solid-to-solid transition, entropies of fusion for urea and twelve alkylurea, Thermochim. Acta, 1987, 122, 143-52. [all data]

Piacente, Ferro, et al., 1990
Piacente, V.; Ferro, D.; Gatta, G. Della, Sublimation enthalpy of eleven alkyl derivatives of urea, Thermochimica Acta, 1990, 158, 1, 79-85, https://doi.org/10.1016/0040-6031(90)80054-3 . [all data]

Zaitsau, Kabo, et al., 2003
Zaitsau, Dz; Kabo, G.J.; Kozyro, A.A.; Sevruk, V.M., The effect of the failure of isotropy of a gas in an effusion cell on the vapor pressure and enthalpy of sublimation for alkyl derivatives of carbamide, Thermochimica Acta, 2003, 406, 1-2, 17-28, https://doi.org/10.1016/S0040-6031(03)00231-4 . [all data]

Della Gatta and Ferro, 1987
Della Gatta, G.; Ferro, D., Enthalpies of fusion and solid-to-solid transition, entropies of fusion for urea and twelve alkylureas, Thermochim. Acta, 1987, 122, 143-152. [all data]

Domalski and Hearing, 1996
Domalski, Eugene S.; Hearing, Elizabeth D., Heat Capacities and Entropies of Organic Compounds in the Condensed Phase. Volume III, J. Phys. Chem. Ref. Data, 1996, 25, 1, 1, https://doi.org/10.1063/1.555985 . [all data]