Guaia-3,10(14)-dien-11-ol

Normal alkane RI, non-polar column, temperature ramp

View large format table.

Column type Active phase I Reference Comment
CapillaryDB-51680.Morteza-Semnani K., Akbarzadeh M., et al., 200630. m/0.25 mm/0.25 μm, He, 60. C @ 5. min, 4. K/min; Tend: 220. C
CapillaryDB-51678.Morteza-Semnani, Akbarzadeh, et al., 200530. m/0.25 mm/0.25 μm, He, 60. C @ 5. min, 4. K/min; Tend: 220. C
CapillaryDB-51679.Morteza-Semnani and Saeedi, 200530. m/0.25 mm/0.25 μm, He, 60. C @ 4. min, 4. K/min; Tend: 220. C

Normal alkane RI, non-polar column, custom temperature program

View large format table.

Column type Active phase I Reference Comment
CapillaryDB-51672.de Menezes, Lemos, et al., 200530. m/0.25 mm/0.25 μm, He; Program: 35C => 4C/min => 180C => 10C/min => 250C

References

Morteza-Semnani K., Akbarzadeh M., et al., 2006
Morteza-Semnani K.; Akbarzadeh M.; Moshiri K., The essential oil composition of Eupatorium cannabinum L. from Iran, Flavour Fragr. J., 2006, 21, 3, 521-523, https://doi.org/10.1002/ffj.1687 . [all data]

Morteza-Semnani, Akbarzadeh, et al., 2005
Morteza-Semnani, K.; Akbarzadeh, M.; Rostami, B., The essential oil composition of Teucrium chamaedrys L. from Iran, Flavour Fragr. J., 2005, 20, 5, 544-546, https://doi.org/10.1002/ffj.1479 . [all data]

Morteza-Semnani and Saeedi, 2005
Morteza-Semnani, K.; Saeedi, M., The essential oil composition of Phlomis bruguieri Desf. from Iran, Flavour Fragr. J., 2005, 20, 3, 344-346, https://doi.org/10.1002/ffj.1459 . [all data]

de Menezes, Lemos, et al., 2005
de Menezes, J.E.S.A.; Lemos, T.L.G.; Silveira, E.R.; Andrade-Neto, M.; Nascimento, R.F.; Pessoa, O.D.L., Volatile constituents of Cordia trichotoma Vell. from the northeast of Brazil, Flavour Fragr. J., 2005, 20, 2, 149-151, https://doi.org/10.1002/ffj.1394 . [all data]