2-Cyclohexen-1-one, 4-ethyl-3,4-dimethyl-

Normal alkane RI, non-polar column, custom temperature program

View large format table.

Column type Active phase I Reference Comment
CapillaryCP Sil 5 CB1150.Guyot, Bouseta, et al., 199850. m/0.32 mm/1.2 μm, He; Program: 30C => 55C/min => 85C => 1C/min => 145C => 3C/min => 250C

References

Guyot, Bouseta, et al., 1998
Guyot, C.; Bouseta, A.; Scheirman, V.; Collin, S., Floral origin markers of chestnut and lime tree honeys, J. Agric. Food Chem., 1998, 46, 2, 625-633, https://doi.org/10.1021/jf970510l . [all data]