Dodecane, 5-methyl-

Phase change data

Data compiled as indicated in comments:
TRC - Thermodynamics Research Center, NIST Boulder Laboratories, Chris Muzny director
AC - William E. Acree, Jr., James S. Chickos

Quantity Value Units Method Reference Comment
Tfus203.6KN/APetrov, Sergienko, et al., 1959Uncertainty assigned by TRC = 2. K; TRC

Enthalpy of vaporization

ΔvapH (kJ/mol) Temperature (K) Method Reference Comment
50.6383.AStephenson and Malanowski, 1987Based on data from 368. - 500. K.; AC

In addition to the Thermodynamics Research Center (TRC) data available from this site, much more physical and chemical property data is available from the following TRC products:

Kovats' RI, non-polar column, temperature ramp

Data compiled by: NIST Mass Spectrometry Data Center, William E. Wallace, director

Column type Capillary
Active phase SE-54
Column length (m) 30.
Carrier gas He
Substrate
Column diameter (mm) 0.25
Phase thickness (μm) 0.25
Tstart (C) 0.
Tend (C) 250.
Heat rate (K/min) 12.
Initial hold (min) 12.
Final hold (min)
I 1255.
ReferenceRembold, Wallner, et al., 1989
Comment MSDC-RI

References

Petrov, Sergienko, et al., 1959
Petrov, A.A.; Sergienko, S.R.; Nechitailo, N.A.; Tsedilina, A.L., Izv. Akad. Nauk SSSR, 1959, 1959, 1091-7. [all data]

Stephenson and Malanowski, 1987
Stephenson, Richard M.; Malanowski, Stanislaw, Handbook of the Thermodynamics of Organic Compounds, 1987, https://doi.org/10.1007/978-94-009-3173-2 . [all data]