2,5-Cyclohexadien-1-one, 3,4,4-trimethyl-

Normal alkane RI, non-polar column, temperature ramp

Data compiled by: NIST Mass Spectrometry Data Center, William E. Wallace, director

Column type Capillary
Active phase HP-5
Column length (m) 30.
Carrier gas He
Substrate
Column diameter (mm) 0.25
Phase thickness (μm) 0.32
Tstart (C) 60.
Tend (C) 250.
Heat rate (K/min) 5.
Initial hold (min) 3.
Final hold (min)
I 1235.
ReferenceAghel, Yamini, et al., 2004
Comment MSDC-RI

References

Aghel, Yamini, et al., 2004
Aghel, N.; Yamini, Y.; Hadjiakhoondi, A.; Pourmortazavi, S.M., Supercritical carbon dioxide extraction of Mentha pulegium L. essential oil, Talanta, 2004, 62, 2, 407-411, https://doi.org/10.1016/j.talanta.2003.08.011 . [all data]