Tetrahydro-1,3-oxazine-2-thione

Normal alkane RI, non-polar column, custom temperature program

View large format table.

Column type Active phase I Reference Comment
CapillaryCP-Sil 5 Cb1115.Collin, Nizet, et al., 200850. m/0.32 mm/1.20 μm, Nitrogen; Program: 40 0C 20 0C/min -> 85 0C 1 0C/min -> 145 0C 3 0C/min -> 250 0C (30 min)

Phase change data

Data compiled by: William E. Acree, Jr., James S. Chickos

Enthalpy of fusion

ΔfusH (kcal/mol) Temperature (K) Method Reference
4.40400.2DSCTemprado, Roux, et al., 2008

References

Collin, Nizet, et al., 2008
Collin, S.; Nizet, S.; Muls, S.; Iraqi, R.; Bouseta, A., Characterization of odor-active compounds in extracts obtained by simultaneous extraction/distillation from Moroccan black olives, J. Agric. Food Chem., 2008, 56, 9, 3273-3278, https://doi.org/10.1021/jf073488x . [all data]