Ethanol, 2-(9,12-octadecadienyloxy)-, (Z,Z)-

Normal alkane RI, non-polar column, temperature ramp

View large format table.

Column type Active phase I Reference Comment
CapillaryOV-12120.Hu, Liang, et al., 201030. m/0.25 mm/0.25 μm, Helium, 50. C @ 3. min, 5. K/min, 250. C @ 2. min

References

Hu, Liang, et al., 2010
Hu, C.-D.; Liang, Y.-Z.; Guo, F.-Q.; Li, X.-R.; Wang, W.-P., Determination of essential oil composition from Osmanthus fragrans tea by GC-MS combined with a chemometric resolution method, Molecules, 2010, 15, 5, 3683-3693, https://doi.org/10.3390/molecules15053683 . [all data]