Hexane, 3,3-diethyl-

Kovats' RI, non-polar column, isothermal

View large format table.

Column type Active phase Temperature (C) I Reference Comment
CapillarySqualane100.954.Heinzen, Soares, et al., 1999
CapillarySqualane60.954.1Chretien and Dubois, 1976
CapillaryVacuum Grease Oil (VM-4)95.957.2Sultanov and Arustamova, 1975N2; Column length: 150. m; Column diameter: 0.25 mm
CapillarySqualane60.954.Matukuma, 1969N2; Column length: 91.4 m; Column diameter: 0.25 mm

References

Heinzen, Soares, et al., 1999
Heinzen, V.E.F.; Soares, M.F.; Yunes, R.A., Semi-empirical topological method for the prediction of the chromatographic retention of cis- and trans-alkene isomers and alkanes, J. Chromatogr. A, 1999, 849, 2, 495-506, https://doi.org/10.1016/S0021-9673(99)00530-0 . [all data]

Chretien and Dubois, 1976
Chretien, J.R.; Dubois, J.-E., New Perspectives in the Prediction of Kovats Indices, J. Chromatogr., 1976, 126, 171-189, https://doi.org/10.1016/S0021-9673(01)84071-1 . [all data]

Sultanov and Arustamova, 1975
Sultanov, N.T.; Arustamova, L.G., Determination of the boiling points of C10 isoalkanes in an n-decane isomerizate from gas chromatographic retention indices, J. Chromatogr., 1975, 115, 2, 553-558, https://doi.org/10.1016/S0021-9673(01)98959-9 . [all data]

Matukuma, 1969
Matukuma, A., Retention indices of alkanes through C10 and alkenes through C8 and relation between boiling points and retention data, Gas Chromatogr., Int. Symp. Anal. Instrum. Div Instrum Soc. Amer., 1969, 7, 55-75. [all data]