Undecane, 3,9-dimethyl-

Kovats' RI, non-polar column, custom temperature program

Data compiled by: NIST Mass Spectrometry Data Center, William E. Wallace, director

Column type CapillaryCapillary
Active phase DC-200DC-200
Column length (m) 100.100.
Carrier gas HeHe
Substrate
Column diameter (mm) 0.250.25
Phase thickness (μm)
Program not specifiednot specified
I 1239.1242.
ReferenceSchomburg and Henneberg, 1968Schomburg and Henneberg, 1968
Comment MSDC-RI MSDC-RI

References

Schomburg and Henneberg, 1968
Schomburg, G.; Henneberg, D., Analyse von i-Paraffingemischen aus ?methylene insertion?-bzw. ?methylene-d2 insertion?-Reaktionen mit einer Kombination Capillar-Gas-Chromatographie/Massenspectrometrie, Anal. Chem., 1968, 236, 1, 279-294, https://doi.org/10.1007/BF00503281 . [all data]