Benzeneacetic acid, 4-hydroxy-, ethyl ester

Normal alkane RI, non-polar column, temperature ramp

View large format table.

Column type Active phase I Reference Comment
CapillaryDB-51559.Güntert, Rapp, et al., 198630. m/0.25 mm/0.25 μm, He, 2. K/min; Tstart: 40. C; Tend: 250. C

References

Güntert, Rapp, et al., 1986
Güntert, M.; Rapp, A.; Takeoka, G.R.; Jennings, W., HRGC and HRGC-MS applied to wine constituents of lower volatility, Z. Lebensm. Unters. Forsch., 1986, 182, 3, 200-204, https://doi.org/10.1007/BF01042128 . [all data]