1-Nitro-3-nitrosobenzene

Phase change data

Data compiled by: Hussein Y. Afeefy, Joel F. Liebman, and Stephen E. Stein

Quantity Value Units Method Reference Comment
Δsub63.kJ/molEBuckland, 1959

References

Buckland, 1959
Buckland, A.C., Heats of combustion of O-nitronitrosobenzene and N-nitronitrosobenzene, M.S. Thesis for Tulane University, 1959, 1-42. [all data]