Hydrazine, 1,1-diphenyl-2-(2,4,6-trinitrophenyl)-

Gas phase ion energetics data

Data compiled by: Sharon G. Lias and Joel F. Liebman

Ionization energy determinations

IE (eV) Method Reference Comment
7.3PEYamamoto, Nagashima, et al., 1990Vertical value

References

Yamamoto, Nagashima, et al., 1990
Yamamoto, H.; Nagashima, U.; Inokuchi, H., Ultraviolet photoelectron spectroscopy of N,N-diphenyl-N'-picrylhydrazine, Chem. Phys. Lett., 1990, 171, 181. [all data]