Tricyclo[4.3.1.0(1,6)deca-3-ene

Gas phase thermochemistry data

Data compiled by: Hussein Y. Afeefy, Joel F. Liebman, and Stephen E. Stein

Quantity Value Units Method Reference Comment
Δfgas95.8kJ/molChydRoth, Klarner, et al., 1992

References

Roth, Klarner, et al., 1992
Roth, W.R.; Klarner, F.-G.; Siepert, G.; Lennartz, H.-W., Zur Frage der Homoaromatizitat von Norcaradien und Cycloheptatrien, Chem. Ber., 1992, 125, 217-224. [all data]