(Diethylamino)ethanol, TMS derivative

Van Den Dool and Kratz RI, non-polar column, temperature ramp

Data compiled by: NIST Mass Spectrometry Data Center, William E. Wallace, director

Column type Capillary
Active phase CP Sil 8 CB
Column length (m) 30.
Carrier gas He
Substrate
Column diameter (mm) 0.25
Phase thickness (μm) 0.25
Tstart (C) 50.
Tend (C) 300.
Heat rate (K/min) 10.
Initial hold (min) 5.
Final hold (min) 2.
I 1044.24
ReferenceJagadeshwar Reddy, Prabhakar, et al., 2006
Comment MSDC-RI

References

Jagadeshwar Reddy, Prabhakar, et al., 2006
Jagadeshwar Reddy, T.; Prabhakar, S.; Ravi Kumar, M.; Vijaya Saradhi, U.V.R.; Vairamani, M., Mass spectral studies of a series of N,N-dialkyl aminoethyl-2-chlorides and trimethyl silyl ethers of N,N-dialkyl aminoethane-2-ols under electron impact conditions, J. Mass Spectrom., 2006, 41, 1, 59-70, https://doi.org/10.1002/jms.946 . [all data]