cis-(4-Methyl-1-pentenyl) ethyl ether

Reaction thermochemistry data

Data compiled by: Hussein Y. Afeefy, Joel F. Liebman, and Stephen E. Stein

Individual Reactions

cis-(4-Methyl-1-pentenyl) ethyl ether = Ether, ethyl 4-methyl-1-pentyl, (E)

By formula: C8H16O = C8H16O

Quantity Value Units Method Reference Comment
Δr-2.74 ± 0.12kJ/molEqkOkuyama, Fueno, et al., 1969liquid phase; GC

References

Okuyama, Fueno, et al., 1969
Okuyama, T.; Fueno, T.; Furukawa, J., Structure and reactivity of α,β-unsaturated ethers. 9. Cis-trans isomerization equilibriums in the liquid phase, Tetrahedron, 1969, 25, 5409-5414. [all data]