Rebemide

Phase change data

Data compiled by: William E. Acree, Jr., James S. Chickos

Quantity Value Units Method Reference Comment
Δsub21.8 ± 0.76kcal/molCRibeiro Da Silva, Souza, et al., 1989

Enthalpy of vaporization

ΔvapH (kcal/mol) Temperature (K) Method Reference Comment
13.5388.AStephenson and Malanowski, 1987Based on data from 373. - 403. K.
12.7389.N/ADavydova, Makolkin, et al., 1969Based on data from 374. - 405. K.

References

Ribeiro Da Silva, Souza, et al., 1989
Ribeiro Da Silva, M.D.M.C.; Souza, P.; Pilcher, G., Enthalpies of combustion of thiobenzamide, N,N-dimethylthiobenzamide, and N,N-diethylthiobenzamide, J. Chem. Thermodyn., 1989, 21, 173-178. [all data]

Stephenson and Malanowski, 1987
Stephenson, Richard M.; Malanowski, Stanislaw, Handbook of the Thermodynamics of Organic Compounds, 1987, https://doi.org/10.1007/978-94-009-3173-2 . [all data]

Davydova, Makolkin, et al., 1969
Davydova, Zh.V.; Makolkin, I.A.; Bataev, P.S., Zh. Obshch. Khim., 1969, 39, 8, 1668. [all data]