Benzenamine, 2,6-dimethyl-4-nitro-

Gas phase ion energetics data

Data compiled by: Sharon G. Lias, Rhoda D. Levin, and Sherif A. Kafafi

Ionization energy determinations

IE (eV) Method Reference Comment
8.33PEKhalil, Meeks, et al., 1973Vertical value

References

Khalil, Meeks, et al., 1973
Khalil, O.S.; Meeks, J.L.; McGlynn, S.P., Electronic spectroscopy of highly polar aromatics. VII. Photoelectron spectra of nitroanilines, J. Am. Chem. Soc., 1973, 95, 5876. [all data]