sodium tetrahydroborate

Condensed phase thermochemistry data

Quantity Value Units Method Reference Comment
Δfsolid-191.84kJ/molReviewChase, 1998Data last reviewed in December, 1964
Quantity Value Units Method Reference Comment
solid101.46J/mol*KReviewChase, 1998Data last reviewed in December, 1964

Solid Phase Heat Capacity (Shomate Equation)

Cp° = A + B*t + C*t2 + D*t3 + E/t2
H° − H°298.15= A*t + B*t2/2 + C*t3/3 + D*t4/4 − E/t + F − H
S° = A*ln(t) + B*t + C*t2/2 + D*t3/3 − E/(2*t2) + G
    Cp = heat capacity (J/mol*K)
    H° = standard enthalpy (kJ/mol)
    S° = standard entropy (J/mol*K)
    t = temperature (K) / 1000.

View plot Requires a JavaScript / HTML 5 canvas capable browser.

View table.

Temperature (K) 298. - 2000.
A 34.11286
B 176.9217
C -105.0448
D 20.74812
E 0.755099
F -206.4348
G 98.72650
H -191.8360
ReferenceChase, 1998
Comment Data last reviewed in December, 1964

References

Chase, 1998
Chase, M.W., Jr., NIST-JANAF Themochemical Tables, Fourth Edition, J. Phys. Chem. Ref. Data, Monograph 9, 1998, 1-1951. [all data]