indole, 1-isopropyl-

Phase change data

Data compiled by: Thermodynamics Research Center, NIST Boulder Laboratories, Chris Muzny director

Quantity Value Units Method Reference Comment
Tboil349.15KN/ANilsson, Berg, et al., 1984Uncertainty assigned by TRC = 1.5 K

In addition to the Thermodynamics Research Center (TRC) data available from this site, much more physical and chemical property data is available from the following TRC products:

References

Nilsson, Berg, et al., 1984
Nilsson, I.; Berg, U.; Sandstrom, J., Conformational Analysis of 1- and 3-Isopropylindoles. A 1H NMR and Molecular Mechanics Study, Acta Chem. Scand., Ser. B, 1984, 38, 491. [all data]