Butanoic acid, 3-methyl, 1,1-dimethylethyl ester

Kovats' RI, non-polar column, isothermal

Data compiled by: NIST Mass Spectrometry Data Center, William E. Wallace, director

Column type Packed
Active phase SE-30
Column length (m) 3.
Carrier gas N2
Substrate Chromosorb W AW (60-80 mesh)
Column diameter (mm)
Phase thickness (μm)
Temperature (C) 100.
I 912.
ReferenceChastrette, Heintz, et al., 1974
Comment MSDC-RI

References

Chastrette, Heintz, et al., 1974
Chastrette, M.; Heintz, M.; Druilhe, A.; Lefort, D., Analyse chromatographique d'esters aliphatiques saturés. Relations rétention-structure et prévision de la rétention, Bull. Soc. Chim. Fr., 1974, 9/10,Pt.1, 1852-1856. [all data]