Cyclopropylphenylmethane

Phase change data

Data compiled by: Thermodynamics Research Center, NIST Boulder Laboratories, Chris Muzny director

Quantity Value Units Method Reference Comment
Tboil520.5KN/AKishner, 1911Uncertainty assigned by TRC = 1. K
Quantity Value Units Method Reference Comment
Tfus278.KN/AKishner, 1911Uncertainty assigned by TRC = 2. K

In addition to the Thermodynamics Research Center (TRC) data available from this site, much more physical and chemical property data is available from the following TRC products:

References

Kishner, 1911
Kishner, N., Action of Trimethylenecarboxyl Chloride on Bezene in the Presence of Aluminum Chloride, Zh. Russ. Fiz.-Khim. O-va., Chast Khim., 1911, 43, 1163. [all data]