Ethene, (2-methoxyethoxy)-

Phase change data

Data compiled by: Thermodynamics Research Center, NIST Boulder Laboratories, Chris Muzny director

Quantity Value Units Method Reference Comment
Tboil381.KN/AMikhant'ev, Mikhant'ev, et al., 1966Uncertainty assigned by TRC = 5. K

In addition to the Thermodynamics Research Center (TRC) data available from this site, much more physical and chemical property data is available from the following TRC products:

References

Mikhant'ev, Mikhant'ev, et al., 1966
Mikhant'ev, B.I.; Mikhant'ev, V.B.; Mikhant'eva, O.N., Synthesis of Vinyl and Allyl Ethers of Alkoxyethanols, Tr. Probl. Lab. Khim. Vysokomol. Soedin., Voronezh. Gos. Univ., 1966, No. 4, 34-41. [all data]