4a(2H)-Naphthalenol, octahydro-, trans-

Condensed phase thermochemistry data

Data compiled by: Hussein Y. Afeefy, Joel F. Liebman, and Stephen E. Stein

Quantity Value Units Method Reference Comment
Δfsolid-445. ± 21.kJ/molCcbBreitenbach and Derkosch, 1951Reanalyzed by Cox and Pilcher, 1970, Original value = -443.5 kJ/mol
Quantity Value Units Method Reference Comment
Δcsolid-6063.0kJ/molCcbBreitenbach and Derkosch, 1951Corresponding Δfsolid = -444.3 kJ/mol (simple calculation by NIST; no Washburn corrections)

References

Breitenbach and Derkosch, 1951
Breitenbach, J.W.; Derkosch, J., Verbrennungswarmen von peroxyden und verwandten verbindungen sowie von polystrolen, Monatsh. Chem., 1951, 82, 177-179. [all data]

Cox and Pilcher, 1970
Cox, J.D.; Pilcher, G., Thermochemistry of Organic and Organometallic Compounds, Academic Press, New York, 1970, 1-636. [all data]