Tricyclo[4.2.1.02,5]nonane, exo-

Gas phase ion energetics data

Data compiled as indicated in comments:
LLK - Sharon G. Lias, Rhoda D. Levin, and Sherif A. Kafafi

Ionization energy determinations

IE (eV) Method Reference Comment
8.8PEBrogli, Eberbach, et al., 1973LLK
9.5 ± 0.05PEBrogli, Eberbach, et al., 1973Vertical value; LLK

References

Brogli, Eberbach, et al., 1973
Brogli, F.; Eberbach, W.; Haselbach, E.; Heilbronner, E.; Hornung, V.; Lemal, D.M., 199. Die photoelecktronen-spektren des tricyclo[4.2.1.02,5]nonadiens und seines 3,4-diaza-analogons. Ein Beitrag zur kenntnis der wechselwirkung zwischen den einsamen elektronenpaaren der cis-konfigurierten azogrupp, Helv. Chim. Acta, 1973, 56, 1933. [all data]