Triethyl 1,1,1-ethanetricarboxylate

Phase change data

Data compiled by: Hussein Y. Afeefy, Joel F. Liebman, and Stephen E. Stein

Quantity Value Units Method Reference Comment
Δvap74.14 ± 0.42kJ/molVRakus, Verevkin, et al., 1995

References

Rakus, Verevkin, et al., 1995
Rakus, K.; Verevkin, S.P.; Keller, M.; Beckhaus, H.-D.; Ruchardt, C., Radical stabilization enthalpies of α,α-bis(methoxycarbonyl)alkyl and tris(methoxycarbonyl)methyl radicals, Liebigs Ann. Chem., 1995, 1483-1493. [all data]