Benzoic acid, 4-[(butoxycarbonyl)oxy]-, 4-ethoxyphenyl ester

Phase change data

Data compiled by: Eugene S. Domalski and Elizabeth D. Hearing

Temperature of phase transition

Ttrs (K) Initial Phase Final Phase Reference Comment
358.1liquidliquidKrishnamurthy, 1991Nematic/isotropic.

Enthalpy of phase transition

ΔHtrs (kcal/mol) Temperature (K) Initial Phase Final Phase Reference Comment
5.5927328.3crystaline, IIliquidKrishnamurthy, 1991Radial spherulite/nematic.
7.6004337.6crystaline, IliquidKrishnamurthy, 1991Tangential spherulite/nematic.

References

Krishnamurthy, 1991
Krishnamurthy, K.S., Melting and spherulitic crystallization of a phenyl benzoate, Liq. Cryst., 1991, 9(5), 727-739. [all data]