Azaperone

Normal alkane RI, non-polar column, isothermal

View large format table.

Column type Active phase Temperature (C) I Reference Comment
PackedOV-1240.2703.Courtot, 1976Supelcoport (100-120 mesh); Column length: 2. m
PackedOV-1260.2727.Courtot, 1976Supelcoport (100-120 mesh); Column length: 2. m

Normal alkane RI, non-polar column, custom temperature program

View large format table.

Column type Active phase I Reference Comment
OtherMethyl Silicone2705.Ardrey and Moffat, 1981Program: not specified

References

Courtot, 1976
Courtot, D., Research and identification of tranquillizers - use of retention index, J. Sports Med., 1976, 10, 3, 143-146, https://doi.org/10.1136/bjsm.10.3.143 . [all data]

Ardrey and Moffat, 1981
Ardrey, R.E.; Moffat, A.C., Gas-liquid chromatographic retention indices of 1318 substances of toxicological interest on SE-30 or OV-1 stationary phase, J. Chromatogr., 1981, 220, 3, 195-252, https://doi.org/10.1016/S0021-9673(00)81925-1 . [all data]