m-Dithiane, 1-oxide

Phase change data

Data compiled by: William E. Acree, Jr., James S. Chickos

Enthalpy of fusion

ΔfusH (kJ/mol) Temperature (K) Method Reference
22.6361.9DSCVictoria Roux, Temprado, et al., 2003

References

Victoria Roux, Temprado, et al., 2003
Victoria Roux, Maria; Temprado, Manuel; Jiménez, Pilar; Guzmán-Mejia, Ramón; Juaristi, Eusebio; Chickos, James S., Heat capacities of thiane sulfones and thiane sulfoxide, Thermochimica Acta, 2003, 406, 1-2, 9-16, https://doi.org/10.1016/S0040-6031(03)00220-X . [all data]