Disilane, hexaethyl-

Gas phase ion energetics data

Data compiled by: Sharon G. Lias, John E. Bartmess, Joel F. Liebman, John L. Holmes, Rhoda D. Levin, and W. Gary Mallard

Ionization energy determinations

IE (eV) Method Reference Comment
8.39PEMochida, Worley, et al., 1985Vertical value

References

Mochida, Worley, et al., 1985
Mochida, K.; Worley, S.; Kochi, J., UV photoelectron spectra of peralkylated catenates of Group 4B elements (silicon, germanium, and tin), Bull. Chem. Soc. Jpn., 1985, 58, 3389. [all data]