1,6-Diaminohexane-N,N,N',N'-tetraacetic acid

Condensed phase thermochemistry data

Data compiled by: Hussein Y. Afeefy, Joel F. Liebman, and Stephen E. Stein

Quantity Value Units Method Reference Comment
Δfsolid-1943.3 ± 0.9kJ/molCcbVasil'ev, Borodin, et al., 1995
Quantity Value Units Method Reference Comment
Δcsolid-6995.3 ± 2.4kJ/molCcbVasil'ev, Borodin, et al., 1995

References

Vasil'ev, Borodin, et al., 1995
Vasil'ev, V.P.; Borodin, V.A.; Volkov, A.V., The standard enthalpy of formation of hexamethylenediamine-N,N,N,N-Tetraacetic Acid, Russ. J. Phys. Chem. (Engl. Transl.), 1995, 69, 326-327, In original 356. [all data]