zinc dimyristate

Phase change data

Data compiled by: Eugene S. Domalski and Elizabeth D. Hearing

Enthalpy of fusion

ΔfusH (kJ/mol) Temperature (K) Reference Comment
86.000407.Konkoly-Thege, Ruff, et al., 1978

Entropy of fusion

ΔfusS (J/mol*K) Temperature (K) Reference Comment
211.407.Konkoly-Thege, Ruff, et al., 1978

References

Konkoly-Thege, Ruff, et al., 1978
Konkoly-Thege, I.; Ruff, I.; Adeosun, S.O.; Sime, S.J., Properties of molten carboxylates. Part 6. A quantitative differential thermal analysis study of phase transitions in some zinc and cadmium carboxylates, Thermochim. Acta, 1978, 24, 89-96. [all data]