O-Isopropyl S-2-diethylaminoethyl ethylphosphonothiolate

Van Den Dool and Kratz RI, non-polar column, temperature ramp

View large format table.

Column type Active phase I Reference Comment
CapillarySE-541680.Kostiainen, 200025. m/0.32 mm/0.25 μm, He, 40. C @ 1. min, 10. K/min, 280. C @ 10. min

Normal alkane RI, non-polar column, temperature ramp

View large format table.

Column type Active phase I Reference Comment
CapillarySE-541680.Söderström, Ketola, et al., 199525. m/0.32 mm/0.25 μm, He, 40. C @ 2. min, 10. K/min, 250. C @ 10. min

Normal alkane RI, non-polar column, custom temperature program

View large format table.

Column type Active phase I Reference Comment
Capillary5 % Phenyl methyl siloxane1680.OPCW, 1997Program: not specified

References

Kostiainen, 2000
Kostiainen, O., Gas Chromatography in Screening of Chemicals Related to the Chemical Weapons Convention in Encyclopedia of Analytical Chemistry, Meyers, R.A., ed(s)., John Wiley Sons Ltd, Chichester, 2000, 963-979. [all data]

Söderström, Ketola, et al., 1995
Söderström, M.T.; Ketola, R.A.; Kostiainen, O., Identification of some nerve agent homologues and dialkyl methylphosphonates by gas chromatography/Fourier transform infrared spectrometry. Part II. Spectral search with the help of retention indices, Fresenius J. Anal. Chem., 1995, 352, 6, 550-556, https://doi.org/10.1007/BF00323072 . [all data]

OPCW, 1997
OPCW, Conference of the States Parties C-I/DEC.64 (22 May 1997), 1997, retrieved from http://www.opcw.org/html/global/cseries/csp1/CIDEC64.html. [all data]