Diethylaminoacetone

Condensed phase thermochemistry data

Data compiled by: Hussein Y. Afeefy, Joel F. Liebman, and Stephen E. Stein

Quantity Value Units Method Reference Comment
Δfliquid-67.16 ± 0.53kcal/molCcbWelle, Verevkin, et al., 1994
Quantity Value Units Method Reference Comment
Δcliquid-1103.6 ± 0.50kcal/molCcbWelle, Verevkin, et al., 1994

References

Welle, Verevkin, et al., 1994
Welle, f.; Verevkin, S.P.; Keller, M.; Beckhaus, H.-D.; Ruchardt, C., Kinetische und thermodynamische Stabilitat von 2,3-Bis(dialkylamino)-1,4-diketonen - Stabilisierungsenergie capto-dativ substituierter α-Dialkylamino-α-Carbonylalkyl-Radikale, Chem. Ber., 1994, 127, 697-710. [all data]