Rofecoxib

Phase change data

Data compiled by: William E. Acree, Jr., James S. Chickos

Enthalpy of fusion

ΔfusH (kcal/mol) Temperature (K) Method Reference
2.863482.1DSCTung, Tabora, et al., 2008

References

Tung, Tabora, et al., 2008
Tung, Hsien-Hsin; Tabora, Jose; Variankaval, Nara; Bakken, Daniel; Chen, Chau-Chyun, Prediction of pharmaceutical solubilityVia NRTL-SAC and COSMO-SAC, J. Pharm. Sci., 2008, 97, 5, 1813-1820, https://doi.org/10.1002/jps.21032 . [all data]