Bolasterone

Normal alkane RI, non-polar column, temperature ramp

View large format table.

Column type Active phase I Reference Comment
CapillarySE-542727.Schänzer, Opfermann, et al., 19925. K/min; Column length: 17. m; Phase thickness: 0.33 μm; Tstart: 200. C; Tend: 320. C

References

Schänzer, Opfermann, et al., 1992
Schänzer, W.; Opfermann, G.; Donike, M., 17-Epimerization of 17α-methyl anabolic steroids in humans: metabolism and synthesis of 17α-hydroxy-17β-methyl steroids, Steroids, 1992, 57, 11, 537-550, https://doi.org/10.1016/0039-128X(92)90023-3 . [all data]