2-Undecanone, 6,10-dimethyl-

Condensed phase thermochemistry data

Data compiled as indicated in comments:
ALS - Hussein Y. Afeefy, Joel F. Liebman, and Stephen E. Stein
DH - Eugene S. Domalski and Elizabeth D. Hearing

Quantity Value Units Method Reference Comment
Δfliquid-556.7 ± 9.0kJ/molCcbGadzhiev, Kerimov, et al., 1982ALS
Quantity Value Units Method Reference Comment
Δcliquid-8274.6kJ/molCcbGadzhiev, Kerimov, et al., 1982Corresponding Δfliquid = -556.8 kJ/mol (simple calculation by NIST; no Washburn corrections); ALS

Constant pressure heat capacity of liquid

Cp,liquid (J/mol*K) Temperature (K) Reference Comment
428.4313.55Baglay, Gurariy, et al., 1988T = 270 to 340 K. Unsmoothed experimental datum.; DH

Van Den Dool and Kratz RI, non-polar column, temperature ramp

Data compiled by: NIST Mass Spectrometry Data Center, William E. Wallace, director

Column type CapillaryCapillary
Active phase HP-5SE-54
Column length (m) 30.25.
Carrier gas He
Substrate
Column diameter (mm) 0.250.30
Phase thickness (μm) 0.250.25
Tstart (C) 50.80.
Tend (C) 220.300.
Heat rate (K/min) 3.8.
Initial hold (min)
Final hold (min) 20.
I 1408.1400.
ReferenceXian Q., Chen H., et al., 2006Azevedo, Zinu, et al., 2001
Comment MSDC-RI MSDC-RI

Kovats' RI, non-polar column, isothermal

Data compiled by: NIST Mass Spectrometry Data Center, William E. Wallace, director

Column type CapillaryCapillary
Active phase SE-30OV-101
Column length (m) 40.50.
Carrier gas  N2
Substrate
Column diameter (mm) 0.350.26
Phase thickness (μm) 0.35
Temperature (C) 100.170.
I 1389.81391.
ReferenceTudor, 1997Gribanova, Kharitonov, et al., 1990
Comment MSDC-RI MSDC-RI

References

Gadzhiev, Kerimov, et al., 1982
Gadzhiev, S.N.; Kerimov, K.K.; Gubareva, A.I.; Beregovykh, V.V.; Ignat'ev, V.L.; Nurullaev, G.G., Study of the physicochemical properties of polyene compounds and their derivatives, Khim.-Farm. Zh., 1982, 16, 1131-1133. [all data]

Baglay, Gurariy, et al., 1988
Baglay, A.K.; Gurariy, L.L.; Kuleshov, G.G., Physical properties of compounds used in vitamin synthesis, J. Chem. Eng. Data, 1988, 33, 512-518. [all data]