1,1-Diphenyldodecane

Condensed phase thermochemistry data

Data compiled by: Eugene S. Domalski and Elizabeth D. Hearing

Quantity Value Units Method Reference Comment
liquid684.9J/mol*KN/AKarasharli and Strelkov, 1960
liquid684.9J/mol*KN/AKarasharli and Strelkov, 1960, 2

Constant pressure heat capacity of liquid

Cp,liquid (J/mol*K) Temperature (K) Reference Comment
593.7298.15Karasharli and Strelkov, 1960, 2T = 10 to 300 K.
593.9298.15Karasharli and Strelkov, 1960T = 10 to 300 K.

Phase change data

Data compiled as indicated in comments:
TRC - Thermodynamics Research Center, NIST Boulder Laboratories, Chris Muzny director
AC - William E. Acree, Jr., James S. Chickos
DH - Eugene S. Domalski and Elizabeth D. Hearing

Quantity Value Units Method Reference Comment
Ttriple281.40KN/AKarasharli and Strelkov, 1960, 3Crystal phase 1 phase; Uncertainty assigned by TRC = 0.02 K; TRC
Ttriple281.4KN/AKarasharli and Strelkov, 1960, 4Crystal phase 1 phase; Uncertainty assigned by TRC = 0.2 K; TRC

Enthalpy of fusion

ΔfusH (kcal/mol) Temperature (K) Reference Comment
9.281281.4Domalski and Hearing, 1996AC

Enthalpy of phase transition

ΔHtrs (kcal/mol) Temperature (K) Initial Phase Final Phase Reference Comment
0.4608191.crystaline, IIcrystaline, IKarasharli and Strelkov, 1960DH
9.2839281.40crystaline, IliquidKarasharli and Strelkov, 1960DH
0.4610191.crystaline, IIcrystaline, IKarasharli and Strelkov, 1960, 2DH
9.2839281.4crystaline, IliquidKarasharli and Strelkov, 1960, 2DH

Entropy of phase transition

ΔStrs (cal/mol*K) Temperature (K) Initial Phase Final Phase Reference Comment
2.41191.crystaline, IIcrystaline, IKarasharli and Strelkov, 1960DH
33.01281.40crystaline, IliquidKarasharli and Strelkov, 1960DH
2.41191.crystaline, IIcrystaline, IKarasharli and Strelkov, 1960, 2DH
32.98281.4crystaline, IliquidKarasharli and Strelkov, 1960, 2DH

In addition to the Thermodynamics Research Center (TRC) data available from this site, much more physical and chemical property data is available from the following TRC products:

References

Karasharli and Strelkov, 1960
Karasharli, K.A.; Strelkov, P.G., Thermodynamic investigations of 1,1-dicyclohexyldodecane, 1,1-diphenyldodecane, 1-phenyl-1-cyclohexyldodecane at low temperature, Dokl. Akad. Nauk, 1960, SSSR 131, 568-569. [all data]

Karasharli and Strelkov, 1960, 2
Karasharli, K.A.; Strelkov, P.G., Thermodynamic properties of 1,1-diphenyldodecane, 14-298K, Dokl. Akad. Nauk Azerb., 1960, SSSR 16, 249-257. [all data]