Naphthalene, 1,2,4,7-tetramethyl-

Lee's RI, non-polar column, temperature ramp

Data compiled by: NIST Mass Spectrometry Data Center, William E. Wallace, director

Column type Capillary
Active phase DB-5
Column length (m) 60.
Carrier gas H2
Substrate
Column diameter (mm) 0.20
Phase thickness (μm)
Tstart (C) 70.
Tend (C) 300.
Heat rate (K/min) 2.
Initial hold (min)
Final hold (min) 10.
I 286.26
ReferenceForster, Alexander, et al., 1989
Comment MSDC-RI

References

Forster, Alexander, et al., 1989
Forster, P.G.; Alexander, R.; Kagi, R.I., Identification and analysis of tetramethylnaphthalenes in petroleum, J. Chromatogr., 1989, 483, 384-389, https://doi.org/10.1016/S0021-9673(01)93138-3 . [all data]