Beta-propyl-beta-propiolactone

Condensed phase thermochemistry data

Data compiled by: Hussein Y. Afeefy, Joel F. Liebman, and Stephen E. Stein

Quantity Value Units Method Reference Comment
Δfliquid-452.6 ± 1.6kJ/molCcbDimitriev, Kotovich, et al., 1987
Quantity Value Units Method Reference Comment
Δcliquid-3337.6 ± 1.6kJ/molCcbDimitriev, Kotovich, et al., 1987Corresponding Δfliquid = -452.6 kJ/mol (simple calculation by NIST; no Washburn corrections)

References

Dimitriev, Kotovich, et al., 1987
Dimitriev, Yu.G.; Kotovich, Kh.Z.; Shered'ko, A.A., Heats of formation of β-propyl- and β-isopropyl-β-propiolactone, Vestn. L'vov. Politekh. Inst., 1987, 211, 24-25. [all data]