Octane, 3,6-dimethyl-

Normal alkane RI, non-polar column, temperature ramp

Data compiled by: NIST Mass Spectrometry Data Center, William E. Wallace, director

Column type CapillaryCapillary
Active phase Petrocol DHSE-54
Column length (m) 100.50.
Carrier gas Helium
Substrate
Column diameter (mm) 0.250.32
Phase thickness (μm) 0.50
Tstart (C) 20.60.
Tend (C) 220.200.
Heat rate (K/min) 15.4.
Initial hold (min) 15.2.
Final hold (min) 30.
I 944.937.
ReferenceSupelco, 2012Guan, Li, et al., 1995
Comment MSDC-RI MSDC-RI

Normal alkane RI, non-polar column, custom temperature program

Data compiled by: NIST Mass Spectrometry Data Center, William E. Wallace, director

Column type CapillaryCapillary
Active phase Methyl SiliconePolydimethyl siloxane
Column length (m) 60.
Carrier gas Helium
Substrate
Column diameter (mm) 0.32
Phase thickness (μm) 1.0
Program -50 0C (2 min) 8 0C/min -> 200 0C (7.75 min) 25 0C -> 225 0C (8 min)not specified
I 944.929.
ReferenceBlunden, Aneja, et al., 2005Junkes, Castanho, et al., 2003
Comment MSDC-RI MSDC-RI

Van Den Dool and Kratz RI, non-polar column, temperature ramp

Data compiled by: NIST Mass Spectrometry Data Center, William E. Wallace, director

Column type Capillary
Active phase Cross-Linked Methylsilicone
Column length (m)
Carrier gas
Substrate
Column diameter (mm)
Phase thickness (μm)
Tstart (C) 40.
Tend (C) 300.
Heat rate (K/min) 5.
Initial hold (min)
Final hold (min)
I 942.
ReferenceKhorasheh, Gray, et al., 1989
Comment MSDC-RI

References

Supelco, 2012
Supelco, CatalogNo. 24160-U, Petrocol DH Columns. Catalog No. 24160-U, 2012, retrieved from http://www.sigmaaldrich.com/etc/medialib/docs/Supelco/Datasheet/1/w97949.Par.0001.File.tmp/w97949.pdf. [all data]

Guan, Li, et al., 1995
Guan, Y.; Li, L.; Zhou, L., Live retention database for compound identification in capillary gas chromatography, Chin. J. Chromatogr., 1995, 13, 5, 851-857. [all data]