Benzenepentacarboxylic acid

Condensed phase thermochemistry data

Data compiled by: Hussein Y. Afeefy, Joel F. Liebman, and Stephen E. Stein

Quantity Value Units Method Reference Comment
Δfsolid-461.21 ± 0.29kcal/molCcbYukhno and Bikkulov, 1971
Quantity Value Units Method Reference Comment
Δcsolid-778.30 ± 0.29kcal/molCcbYukhno and Bikkulov, 1971Corresponding Δfsolid = -461.21 kcal/mol (simple calculation by NIST; no Washburn corrections)

References

Yukhno and Bikkulov, 1971
Yukhno, G.F.; Bikkulov, A.Z., Enthalpies of combustion and formation of benzenecarboxylic acids, Russ. J. Phys. Chem. (Engl. Transl.), 1971, 45, 924-925. [all data]