2-Chloro-N,N-diethylacetoacetamide

Phase change data

Data compiled by: Robert L. Brown and Stephen E. Stein

Reduced pressure boiling point

Tboil (K) Pressure (bar) Reference
415. - 416.0.020Frinton Laboratories Inc., 1986

References

Frinton Laboratories Inc., 1986
Frinton Laboratories Inc., Catalog Number 11, Frinton Laboratories Inc., Vineland, NJ, 1986, 99. [all data]