Hydrazine, 1-benzyl-2-phenyl-

Phase change data

Data compiled by: Robert L. Brown and Stephen E. Stein

Quantity Value Units Method Reference Comment
Tboil563.KN/ABuckingham and Donaghy, 1982
Quantity Value Units Method Reference Comment
Tfus308.KN/ABuckingham and Donaghy, 1982

References

Buckingham and Donaghy, 1982
Buckingham, J.; Donaghy, S.M., Dictionary of Organic Compounds: Fifth Edition, Chapman and Hall, New York, 1982, 1. [all data]